Fedora-ARM

camcintosh1 packages

Package Building and Troubleshooting

When I was building these I had some missing files and folders so I edited the spec file to change this for GVFS.

Had to add some packages to Build Requires and put them in order for Xnee.

It its hard though, having trouble with some packages and there errors I am not familiar with, I cannot get a spec file for two packages to edit. The time is a killer on my Net Book but slowly and surely wins the race? I guess.

Working on Glob for DIST-f12.. Failed but cannot really understand the error because it uses SCON instead of make and make install.

There was not enough space one time so I will try when I get to school.

 

Our group is almost done the chart:

http://zenit.senecac.on.ca/wiki/index.php/Fedora-ARM_Package_Building_and_Troubleshooting/Problems

 

Done Packages:
DIST-f13 = glob2-0.9.4.4-1.fc13.armv5tel

DIST-f13 = gvfs-1.4.1-3.fc13.armv5tel

DIST-f12 = gvfs-1.4.1-3.fc13.armv5tel

 

From Precious Labs Packages Done:

dist-f13, nano-2.2.6-1.fc13.src.rpm

dist-f13, xnee-3.08-1.fc13.src.rpm

 

Errors for GVFS:

error: File not found by glob: /builddir/build/BUILDROOT/gvfs-1.4.1-3.fc13.i386/usr/libexec/gvfsd*/*
error: File not found: /builddir/build/BUILDROOT/gvfs-1.4.1-3.fc13.i386/usr/share/dbus-1/services/org.gtk.Private.AfcVolumeMonitor.service
 File not found by glob: /builddir/build/BUILDROOT/gvfs-1.4.1-3.fc13.i386/usr/libexec/gvfsd*/*
 File not found: /builddir/build/BUILDROOT/gvfs-1.4.1-3.fc13.i386/usr/share/dbus-1/services/org.gtk.Private.AfcVolumeMonitor.service

 

MOCK and ARM-KOJI Output:

[camcintosh1@result]$ arm-koji build dist-f13 –scratch glob2-0.9.4.4-1.fc13.src.rpm
Uploading srpm: glob2-0.9.4.4-1.fc13.src.rpm
[====================================] 100% 00:03:42  10.80 MiB  49.68 KiB/sec
Created task: 87202
Task info: http://arm.koji.fedoraproject.org/koji/taskinfo?taskID=87202
Watching tasks (this may be safely interrupted)…
87202 build (dist-f13, glob2-0.9.4.4-1.fc13.src.rpm): free
87202 build (dist-f13, glob2-0.9.4.4-1.fc13.src.rpm): free -> open (cdot-guru-2-1)
87203 buildArch (glob2-0.9.4.4-1.fc13.src.rpm, armv5tel): open (cdot-guru-3-5)
87203 buildArch (glob2-0.9.4.4-1.fc13.src.rpm, armv5tel): open (cdot-guru-3-5) -> closed
0 free  1 open  1 done  0 failed
87202 build (dist-f13, glob2-0.9.4.4-1.fc13.src.rpm): open (cdot-guru-2-1) -> closed
0 free  0 open  2 done  0 failed

87202 build (dist-f13, glob2-0.9.4.4-1.fc13.src.rpm) completed successfully

[camcintosh1@tmp]$ mock -r fedora-12-i386 glob2-0.9.4.4-1.fc13.src.rpm
INFO: mock.py version 1.1.6 starting…
State Changed: init plugins
INFO: selinux enabled
State Changed: start
INFO: Start(glob2-0.9.4.4-1.fc13.src.rpm)  Config(fedora-12-i386)
State Changed: lock buildroot
State Changed: clean
State Changed: init
State Changed: lock buildroot
Mock Version: 1.1.6
INFO: Mock Version: 1.1.6
INFO: enabled root cache
INFO: enabled yum cache
State Changed: cleaning yum metadata
INFO: enabled ccache
State Changed: running yum
State Changed: creating cache
State Changed: setup
State Changed: build
INFO: Done(glob2-0.9.4.4-1.fc13.src.rpm) Config(fedora-12-i386) 73 minutes 28 seconds
INFO: Results and/or logs in: /var/lib/mock/fedora-12-i386/result
[camcintosh1@breezy tmp]$ cd /var/lib/mock/fedora-12-i386/result/
[camcintosh1@breezy result]$ ls
build.log                      glob2-debuginfo-0.9.4.4-1.fc12.i686.rpm
glob2-0.9.4.4-1.fc12.i686.rpm  root.log
glob2-0.9.4.4-1.fc12.src.rpm   state.log

[camcintosh1@result]$ arm-koji build dist-f12 –scratch glob2-0.9.4.4-1.fc12.src.rpm
Uploading srpm: glob2-0.9.4.4-1.fc12.src.rpm
[====================================] 100% 00:03:27  10.80 MiB  53.22 KiB/sec
Created task: 87204
Task info: http://arm.koji.fedoraproject.org/koji/taskinfo?taskID=87204
Watching tasks (this may be safely interrupted)…
87204 build (dist-f12, glob2-0.9.4.4-1.fc12.src.rpm): open (cdot-guru-4-2)
87205 buildArch (glob2-0.9.4.4-1.fc12.src.rpm, armv5tel): open (cdot-panda-6-3)
l  87205 buildArch (glob2-0.9.4.4-1.fc12.src.rpm, armv5tel): open (cdot-panda-6-3) -> FAILED: BuildError: error building package (arch armv5tel), mock exited with status 1; see build.log for more information
0 free  1 open  0 done  1 failed
87204 build (dist-f12, glob2-0.9.4.4-1.fc12.src.rpm): open (cdot-guru-4-2) -> FAILED: BuildError: error building package (arch armv5tel), mock exited with status 1; see build.log for more information
0 free  0 open  0 done  2 failed

87204 build (dist-f12, glob2-0.9.4.4-1.fc12.src.rpm) failed

 

 

•Blog Soon! •

Let me know how you feel, my friend :)

Fill in your details below or click an icon to log in:

WordPress.com Logo

You are commenting using your WordPress.com account. Log Out / Change )

Twitter picture

You are commenting using your Twitter account. Log Out / Change )

Facebook photo

You are commenting using your Facebook account. Log Out / Change )

Google+ photo

You are commenting using your Google+ account. Log Out / Change )

Connecting to %s